�s���{���R�[�h���͎s�撬���R�[�h,NO,�s���{����,�s�撬����,����,����_�J�i,����_�ʏ�,POI�R�[�h,�Z��,����,�ܓx,�o�x,�d�b�ԍ�,�����ԍ�,�@�l�ԍ�,�c�̖�,���p�\�j��,�J�n����,�I������,���p�\�������L����,����,�o���A�t���[���,URL,���l,�X�֔ԍ�,�A�N�Z�X���@,���ԏ�_�L��,���ԏ���,����_�v��,����(��{),����(�ڍ�),���p����_�L��,���p����_�ڍ�,������_�L��,������_�ڍ�,�摜,�摜_���C�Z���X,�摜_�ڍ�,�ŏI�m�F��
131083,1,�����s,�]����,��꒚�ڃA�p�[�g1����,�I�E�M�o�V�C�b�`���E���A�p�[�g�C�`�S�E�g�E,,0403a,�]����1-20-1,,35.68398,139.810889,03-3647-9464,,,,,,,,,,https://www.city.koto.lg.jp/kurashi/sumai/moshikomi/index.html,,,,,,,,,,,,,,,,2019/10/9
131083,2,�����s,�]����,��꒚�ڃA�p�[�g2����,�I�E�M�o�V�C�b�`���E���A�p�[�g�j�S�E�g�E,,0403a,�]����1-20-2,,35.683566,139.810911,03-3647-9464,,,,,,,,,,https://www.city.koto.lg.jp/kurashi/sumai/moshikomi/index.html,,,,,,,,,,,,,,,,2019/10/9
131083,3,�����s,�]����,���l�Z��1����,�V�I�n�}�W���E�^�N�C�`�S�E�g�E,,0403a,�]���扖�l2-25-1,,35.664665,139.814396,03-3647-9464,,,,,,,,,,https://www.city.koto.lg.jp/kurashi/sumai/moshikomi/index.html,,,,,,,,,,,,,,,,2019/10/9
131083,4,�����s,�]����,���l�Z��2����,�V�I�n�}�W���E�^�N�j�S�E�g�E,,0403a,�]���扖�l2-25-2,,35.664963,139.814349,03-3647-9464,,,,,,,,,,https://www.city.koto.lg.jp/kurashi/sumai/moshikomi/index.html,,,,,,,,,,,,,,,,2019/10/9
131083,5,�����s,�]����,���]�꒚�ڃA�p�[�g,�T���G�C�b�`���E���A�p�[�g,,0403a,�]���扎�]1-11-22,,35.686346,139.8131,03-3647-9464,,,,,,,,,,https://www.city.koto.lg.jp/kurashi/sumai/moshikomi/index.html,�ߘa6�N4���܂ŉ��z��,,,,,,,,,,,,,,,2022/4/1
131083,6,�����s,�]����,�k���񒚖ڃA�p�[�g,�L�^�X�i�j�`���E���A�p�[�g,,0403a,�]����k��2-9-16,,35.679244,139.826003,03-3647-9464,,,,,,,,,,https://www.city.koto.lg.jp/kurashi/sumai/moshikomi/index.html,,,,,,,,,,,,,,,,2019/10/9
131083,7,�����s,�]����,�哇�ܒ��ڏZ��,�I�I�W�}�S�`���E���W���E�^�N,,0403a,�]����哇5-27-17,,35.686174,139.835935,03-3647-9464,,,,,,,,,,https://www.city.koto.lg.jp/kurashi/sumai/moshikomi/index.html,�ߘa6�N7���܂ŉ��z��,,,,,,,,,,,,,,,2022/4/1
131083,8,�����s,�]����,���������ڏZ��,�q�K�V�X�i�n�b�`���E���W���E�^�N,,0403a,�]���擌��8-24-1,,35.667463,139.842171,03-3647-9464,,,,,,,,,,https://www.city.koto.lg.jp/kurashi/sumai/moshikomi/index.html,,,,,,,,,,,,,,,,2019/10/9
131083,9,�����s,�]����,�X���񒚖ڏZ��,�����V�^�j�`���E���W���E�^�N,,0403a,�]����X��2-14-10,,35.687643,139.800152,03-3647-9464,,,,,,,,,,https://www.city.koto.lg.jp/kurashi/sumai/moshikomi/index.html,,,,,,,,,,,,,,,,2019/10/9
131083,10,�����s,�]����,���l�꒚�ڏZ��12����,�V�I�n�}�C�b�`���E���W���E�^�N�W���E�j�S�E�g�E,,0403a,�]���扖�l1-4-12,,35.661518,139.801481,03-3647-9464,,,,,,,,,,https://www.city.koto.lg.jp/kurashi/sumai/moshikomi/index.html,,,,,,,,,,,,,,,,2019/10/9
131083,11,�����s,�]����,���l�꒚�ڏZ��14����,�V�I�n�}�C�b�`���E���W���E�^�N�W���E�����S�E�g�E,,0403a,�]���扖�l1-4-14,,35.661049,139.800928,03-3647-9464,,,,,,,,,,https://www.city.koto.lg.jp/kurashi/sumai/moshikomi/index.html,,,,,,,,,,,,,,,,2019/10/9
131083,12,�����s,�]����,�k�������ڏZ��1����,�L�^�X�i�i�i�`���E���W���E�^�N�C�`�S�E�g�E,,0403a,�]����k��7-2-1,,35.677248,139.83473,03-3647-9464,,,,,,,,,,https://www.city.koto.lg.jp/kurashi/sumai/moshikomi/index.html,,,,,,,,,,,,,,,,2019/10/9
131083,13,�����s,�]����,�k�������ڏZ��2����,�L�^�X�i�i�i�`���E���W���E�^�N�j�S�E�g�E,,0403a,�]����k��7-2-2,,35.677562,139.834811,03-3647-9464,,,,,,,,,,https://www.city.koto.lg.jp/kurashi/sumai/moshikomi/index.html,,,,,,,,,,,,,,,,2019/10/9
131083,14,�����s,�]����,�k�������ڏZ��3����,�L�^�X�i�i�i�`���E���W���E�^�N�T���S�E�g�E,,0403a,�]����k��7-2-3,,35.677878,139.834908,03-3647-9464,,,,,,,,,,https://www.city.koto.lg.jp/kurashi/sumai/moshikomi/index.html,,,,,,,,,,,,,,,,2019/10/9
131083,15,�����s,�]����,�k�������ڏZ��4����,�L�^�X�i�i�i�`���E���W���E�^�N�����S�E�g�E,,0403a,�]����k��7-2-4,,35.678156,139.835116,03-3647-9464,,,,,,,,,,https://www.city.koto.lg.jp/kurashi/sumai/moshikomi/index.html,,,,,,,,,,,,,,,,2019/10/9
131083,16,�����s,�]����,���z�꒚�ڏZ��,�g�E���E�C�b�`���E���W���E�^�N,,0403a,�]���擌�z1-15-9,,35.667862,139.810391,03-3647-9464,,,,,,,,,,https://www.city.koto.lg.jp/kurashi/sumai/moshikomi/index.html,,,,,,,,,,,,,,,,2019/10/9
131083,17,�����s,�]����,���z�꒚�ڑ��Z��,�g�E���E�C�b�`���E���_�C�j�W���E�^�N,,0403a,�]���擌�z1-10-5,,35.668354,139.808938,03-3647-9464,,,,,,,,,,https://www.city.koto.lg.jp/kurashi/sumai/moshikomi/index.html,,,,,,,,,,,,,,,,2019/10/9
131083,18,�����s,�]����,�s�A���݂悵,�s�A�X�~���V,,0403a,�]����Z�g2-8-9,,35.689743,139.815283,03-3647-9464,,,,,,,,,,https://www.city.koto.lg.jp/kurashi/sumai/moshikomi/index.html,,,,,,,,,,,,,,,,2019/10/9
131083,19,�����s,�]����,�s�A�����Ƃ�,�s�A�R�E�g�E,,0403a,�]���擌�z6-2-17,,35.674728,139.812491,03-3647-9464,,,,,,,,,,https://www.city.koto.lg.jp/kurashi/sumai/moshikomi/index.html,,,,,,,,,,,,,,,,2019/10/9
131083,20,�����s,�]����,�s�A��������,�s�A�I�I�W�},,0403a,�]����哇6-14-4,,35.692999,139.836326,03-3647-9464,,,,,,,,,,https://www.city.koto.lg.jp/kurashi/sumai/moshikomi/index.html,,,,,,,,,,,,,,,,2019/10/9
